Console Output

Skipping 4,440 KB.. Full Log
[build 1:27:18.1 s] [30/32 complete] [6/6 jobs] [0 queued] [pnc:make (99%) ... 
[build 1:27:18.2 s] [30/32 complete] [6/6 jobs] [0 queued] [pnc:make (99%) ... 
[build 1:27:18.3 s] [30/32 complete] [6/6 jobs] [0 queued] [pnc:make (99%) ... 
[build 1:27:18.4 s] [30/32 complete] [6/6 jobs] [0 queued] [pnc:make (99%) ... 
[build 1:27:18.5 s] [30/32 complete] [6/6 jobs] [0 queued] [pnc:make (99%) ... 
[build 1:27:18.6 s] [30/32 complete] [6/6 jobs] [0 queued] [pnc:make (99%) ... 
[build 1:27:18.7 s] [30/32 complete] [5/6 jobs] [0 queued] [pnc:make (99%) ... 
[build 1:27:18.8 s] [30/32 complete] [5/6 jobs] [0 queued] [pnc:make (99%) ... 
[build 1:27:18.9 s] [30/32 complete] [5/6 jobs] [0 queued] [pnc:make (99%) ... 
[build 1:27:19.0 s] [30/32 complete] [5/6 jobs] [0 queued] [pnc:make (99%) ... 
[build 1:27:19.1 s] [30/32 complete] [5/6 jobs] [0 queued] [pnc:make (99%) ... 
[build 1:27:19.2 s] [30/32 complete] [5/6 jobs] [0 queued] [pnc:make (99%) ... 
[build 1:27:19.3 s] [30/32 complete] [5/6 jobs] [0 queued] [pnc:make (99%) ... 
[build 1:27:19.4 s] [30/32 complete] [5/6 jobs] [0 queued] [pnc:make (99%) ... 
[build 1:27:19.5 s] [30/32 complete] [5/6 jobs] [0 queued] [pnc:make (99%) ... 
[build 1:27:19.6 s] [30/32 complete] [5/6 jobs] [0 queued] [pnc:make (99%) ... 
[build 1:27:19.7 s] [30/32 complete] [5/6 jobs] [0 queued] [pnc:make (99%) ... 
[build 1:27:19.8 s] [30/32 complete] [5/6 jobs] [0 queued] [pnc:make (99%) ... 
[build 1:27:19.9 s] [30/32 complete] [5/6 jobs] [0 queued] [pnc:make (99%) ... 
[build 1:27:20.0 s] [30/32 complete] [5/6 jobs] [0 queued] [pnc:make (99%) ... 
[build 1:27:20.1 s] [30/32 complete] [5/6 jobs] [0 queued] [pnc:make (99%) ... 
[build 1:27:20.2 s] [30/32 complete] [5/6 jobs] [0 queued] [pnc:make (99%) ... 
[build 1:27:20.3 s] [30/32 complete] [5/6 jobs] [0 queued] [pnc:make (99%) ... 
[build 1:27:20.4 s] [30/32 complete] [5/6 jobs] [0 queued] [pnc:make (99%) ... 
[build 1:27:20.5 s] [30/32 complete] [5/6 jobs] [0 queued] [pnc:make (99%) ... 
[build 1:27:20.6 s] [30/32 complete] [5/6 jobs] [0 queued] [pnc:make (99%) ... 
[build 1:27:20.7 s] [30/32 complete] [5/6 jobs] [0 queued] [pnc:make (99%) ... 
[build 1:27:20.8 s] [30/32 complete] [5/6 jobs] [0 queued] [pnc:make (99%) ... 
[build 1:27:20.9 s] [30/32 complete] [5/6 jobs] [0 queued] [pnc:make (99%) ... 
[build 1:27:21.0 s] [30/32 complete] [5/6 jobs] [0 queued] [pnc:make (99%) ... 
[build 1:27:21.1 s] [30/32 complete] [5/6 jobs] [0 queued] [pnc:make (99%) ... 
[build 1:27:21.2 s] [30/32 complete] [5/6 jobs] [0 queued] [pnc:make (99%) ... 
[build 1:27:21.3 s] [30/32 complete] [5/6 jobs] [0 queued] [pnc:make (99%) ... 
[build 1:27:21.4 s] [30/32 complete] [5/6 jobs] [0 queued] [pnc:make (99%) ... 
[build 1:27:21.5 s] [30/32 complete] [5/6 jobs] [0 queued] [pnc:make (99%) ... 
[build 1:27:21.6 s] [30/32 complete] [5/6 jobs] [0 queued] [pnc:make (99%) ... 
[build 1:27:21.7 s] [30/32 complete] [5/6 jobs] [0 queued] [pnc:make (99%) ... 
[build 1:27:21.8 s] [30/32 complete] [5/6 jobs] [0 queued] [pnc:make (99%) ... 
[build 1:27:21.9 s] [30/32 complete] [5/6 jobs] [0 queued] [pnc:make (99%) ... 
[build 1:27:22.0 s] [30/32 complete] [5/6 jobs] [0 queued] [pnc:make (99%) ... 
[build 1:27:22.1 s] [30/32 complete] [6/6 jobs] [0 queued] [pnc:make (99%) ... 
Failed <<< snapshot_store                       [ 4.2 seconds ]                
[build 1:27:22.2 s] [31/32 complete] [4/6 jobs] [0 queued] [1 failed] [pnc:... 
[build 1:27:22.3 s] [31/32 complete] [4/6 jobs] [0 queued] [1 failed] [pnc:... 
[build 1:27:22.4 s] [31/32 complete] [4/6 jobs] [0 queued] [1 failed] [pnc:... 
[build 1:27:22.5 s] [31/32 complete] [4/6 jobs] [0 queued] [1 failed] [pnc:... 
[build 1:27:22.6 s] [31/32 complete] [4/6 jobs] [0 queued] [1 failed] [pnc:... 
[build 1:27:22.7 s] [31/32 complete] [4/6 jobs] [0 queued] [1 failed] [pnc:... 
[build 1:27:22.8 s] [31/32 complete] [4/6 jobs] [0 queued] [1 failed] [pnc:... 
[build 1:27:22.9 s] [31/32 complete] [4/6 jobs] [0 queued] [1 failed] [pnc:... 
[build 1:27:23.0 s] [31/32 complete] [4/6 jobs] [0 queued] [1 failed] [pnc:... 
[build 1:27:23.1 s] [31/32 complete] [4/6 jobs] [0 queued] [1 failed] [pnc:... 
[build 1:27:23.2 s] [31/32 complete] [4/6 jobs] [0 queued] [1 failed] [pnc:... 
[build 1:27:23.3 s] [31/32 complete] [4/6 jobs] [0 queued] [1 failed] [pnc:... 
[build 1:27:23.4 s] [31/32 complete] [4/6 jobs] [0 queued] [1 failed] [pnc:... 
[build 1:27:23.5 s] [31/32 complete] [4/6 jobs] [0 queued] [1 failed] [pnc:... 
[build 1:27:23.6 s] [31/32 complete] [4/6 jobs] [0 queued] [1 failed] [pnc:... 
[build 1:27:23.7 s] [31/32 complete] [4/6 jobs] [0 queued] [1 failed] [pnc:... 
[build 1:27:23.8 s] [31/32 complete] [4/6 jobs] [0 queued] [1 failed] [pnc:... 
[build 1:27:23.9 s] [31/32 complete] [4/6 jobs] [0 queued] [1 failed] [pnc:... 
[build 1:27:24.0 s] [31/32 complete] [4/6 jobs] [0 queued] [1 failed] [pnc:... 
[build 1:27:24.1 s] [31/32 complete] [4/6 jobs] [0 queued] [1 failed] [pnc:... 
[build 1:27:24.2 s] [31/32 complete] [4/6 jobs] [0 queued] [1 failed] [pnc:... 
[build 1:27:24.3 s] [31/32 complete] [4/6 jobs] [0 queued] [1 failed] [pnc:... 
[build 1:27:24.4 s] [31/32 complete] [4/6 jobs] [0 queued] [1 failed] [pnc:... 
[build 1:27:24.5 s] [31/32 complete] [4/6 jobs] [0 queued] [1 failed] [pnc:... 
[build 1:27:24.6 s] [31/32 complete] [3/6 jobs] [0 queued] [1 failed] [pnc:... 
[build 1:27:24.7 s] [31/32 complete] [3/6 jobs] [0 queued] [1 failed] [pnc:... 
[build 1:27:24.8 s] [31/32 complete] [3/6 jobs] [0 queued] [1 failed] [pnc:... 
[build 1:27:24.9 s] [31/32 complete] [3/6 jobs] [0 queued] [1 failed] [pnc:... 
[build 1:27:25.0 s] [31/32 complete] [3/6 jobs] [0 queued] [1 failed] [pnc:... 
[build 1:27:25.1 s] [31/32 complete] [3/6 jobs] [0 queued] [1 failed] [pnc:... 
[build 1:27:25.2 s] [31/32 complete] [3/6 jobs] [0 queued] [1 failed] [pnc:... 
[build 1:27:25.3 s] [31/32 complete] [2/6 jobs] [0 queued] [1 failed] [pnc:... 
[build 1:27:25.4 s] [31/32 complete] [2/6 jobs] [0 queued] [1 failed] [pnc:... 
[build 1:27:25.5 s] [31/32 complete] [2/6 jobs] [0 queued] [1 failed] [pnc:... 
[build 1:27:25.6 s] [31/32 complete] [2/6 jobs] [0 queued] [1 failed] [pnc:... 
[build 1:27:25.7 s] [31/32 complete] [2/6 jobs] [0 queued] [1 failed] [pnc:... 
[build 1:27:25.8 s] [31/32 complete] [2/6 jobs] [0 queued] [1 failed] [pnc:... 
[build 1:27:25.9 s] [31/32 complete] [2/6 jobs] [0 queued] [1 failed] [pnc:... 
[build 1:27:26.0 s] [31/32 complete] [2/6 jobs] [0 queued] [1 failed] [pnc:... 
[build 1:27:26.1 s] [31/32 complete] [2/6 jobs] [0 queued] [1 failed] [pnc:... 
[build 1:27:26.2 s] [31/32 complete] [2/6 jobs] [0 queued] [1 failed] [pnc:... 
[build 1:27:26.3 s] [31/32 complete] [2/6 jobs] [0 queued] [1 failed] [pnc:... 
[build 1:27:26.4 s] [31/32 complete] [2/6 jobs] [0 queued] [1 failed] [pnc:... 
[build 1:27:26.5 s] [31/32 complete] [2/6 jobs] [0 queued] [1 failed] [pnc:... 
[build 1:27:26.6 s] [31/32 complete] [2/6 jobs] [0 queued] [1 failed] [pnc:... 
[build 1:27:26.7 s] [31/32 complete] [2/6 jobs] [0 queued] [1 failed] [pnc:... 
[build 1:27:26.8 s] [31/32 complete] [2/6 jobs] [0 queued] [1 failed] [pnc:... 
[build 1:27:26.9 s] [31/32 complete] [1/6 jobs] [0 queued] [1 failed] [pnc:... 
[build 1:27:27.0 s] [31/32 complete] [1/6 jobs] [0 queued] [1 failed] [pnc:... 
[build 1:27:27.1 s] [31/32 complete] [1/6 jobs] [0 queued] [1 failed] [pnc:... 
[build 1:27:27.2 s] [31/32 complete] [1/6 jobs] [0 queued] [1 failed] [pnc:... 
[build 1:27:27.3 s] [31/32 complete] [1/6 jobs] [0 queued] [1 failed] [pnc:... 
[build 1:27:27.4 s] [31/32 complete] [1/6 jobs] [0 queued] [1 failed] [pnc:... 
[build 1:27:27.5 s] [31/32 complete] [1/6 jobs] [0 queued] [1 failed] [pnc:... 
[build 1:27:27.6 s] [31/32 complete] [1/6 jobs] [0 queued] [1 failed] [pnc:... 
[build 1:27:27.7 s] [31/32 complete] [1/6 jobs] [0 queued] [1 failed] [pnc:... 
[build 1:27:27.8 s] [31/32 complete] [1/6 jobs] [0 queued] [1 failed] [pnc:... 
[build 1:27:27.9 s] [31/32 complete] [1/6 jobs] [0 queued] [1 failed] [pnc:... 
[build 1:27:28.0 s] [31/32 complete] [1/6 jobs] [0 queued] [1 failed] [pnc:... 
[build 1:27:28.1 s] [31/32 complete] [1/6 jobs] [0 queued] [1 failed] [pnc:... 
[build 1:27:28.2 s] [31/32 complete] [1/6 jobs] [0 queued] [1 failed] [pnc:... 
[build 1:27:28.3 s] [31/32 complete] [1/6 jobs] [0 queued] [1 failed] [pnc:... 
[build 1:27:28.4 s] [31/32 complete] [1/6 jobs] [0 queued] [1 failed] [pnc:... 
[build 1:27:28.5 s] [31/32 complete] [1/6 jobs] [0 queued] [1 failed] [pnc:... 
[build 1:27:28.6 s] [31/32 complete] [1/6 jobs] [0 queued] [1 failed] [pnc:... 
[build 1:27:28.7 s] [31/32 complete] [1/6 jobs] [0 queued] [1 failed] [pnc:... 
[build 1:27:28.8 s] [31/32 complete] [1/6 jobs] [0 queued] [1 failed] [pnc:... 
[build 1:27:28.9 s] [31/32 complete] [1/6 jobs] [0 queued] [1 failed] [pnc:... 
[build 1:27:29.0 s] [31/32 complete] [1/6 jobs] [0 queued] [1 failed] [pnc:... 
[build 1:27:29.1 s] [31/32 complete] [1/6 jobs] [0 queued] [1 failed] [pnc:... 
[build 1:27:29.2 s] [31/32 complete] [1/6 jobs] [0 queued] [1 failed] [pnc:... 
[build 1:27:29.3 s] [31/32 complete] [1/6 jobs] [0 queued] [1 failed] [pnc:... 
[build 1:27:29.4 s] [31/32 complete] [1/6 jobs] [0 queued] [1 failed] [pnc:... 
[build 1:27:29.5 s] [31/32 complete] [1/6 jobs] [0 queued] [1 failed] [pnc:... 
[build 1:27:29.6 s] [31/32 complete] [1/6 jobs] [0 queued] [1 failed] [pnc:... 
[build 1:27:29.7 s] [31/32 complete] [1/6 jobs] [0 queued] [1 failed] [pnc:... 
[build 1:27:29.8 s] [31/32 complete] [1/6 jobs] [0 queued] [1 failed] [pnc:... 
[build 1:27:29.9 s] [31/32 complete] [1/6 jobs] [0 queued] [1 failed] [pnc:... 
[build 1:27:30.0 s] [31/32 complete] [1/6 jobs] [0 queued] [1 failed] [pnc:... 
[build 1:27:30.1 s] [31/32 complete] [1/6 jobs] [0 queued] [1 failed] [pnc:... 
[build 1:27:30.2 s] [31/32 complete] [1/6 jobs] [0 queued] [1 failed] [pnc:... 
[build 1:27:30.3 s] [31/32 complete] [1/6 jobs] [0 queued] [1 failed] [pnc:... 
[build 1:27:30.4 s] [31/32 complete] [1/6 jobs] [0 queued] [1 failed] [pnc:... 
[build 1:27:30.5 s] [31/32 complete] [1/6 jobs] [0 queued] [1 failed] [pnc:... 
[build 1:27:30.6 s] [31/32 complete] [1/6 jobs] [0 queued] [1 failed] [pnc:... 
[build 1:27:30.7 s] [31/32 complete] [1/6 jobs] [0 queued] [1 failed] [pnc:... 
[build 1:27:30.8 s] [31/32 complete] [1/6 jobs] [0 queued] [1 failed] [pnc:... 
[build 1:27:30.9 s] [31/32 complete] [1/6 jobs] [0 queued] [1 failed] [pnc:... 
[build 1:27:31.0 s] [31/32 complete] [1/6 jobs] [0 queued] [1 failed] [pnc:... 
[build 1:27:31.1 s] [31/32 complete] [1/6 jobs] [0 queued] [1 failed] [pnc:... 
[build 1:27:31.2 s] [31/32 complete] [1/6 jobs] [0 queued] [1 failed] [pnc:... 
[build 1:27:31.3 s] [31/32 complete] [1/6 jobs] [0 queued] [1 failed] [pnc:... 
[build 1:27:31.4 s] [31/32 complete] [1/6 jobs] [0 queued] [1 failed] [pnc:... 
[build 1:27:31.5 s] [31/32 complete] [1/6 jobs] [0 queued] [1 failed] [pnc:... 
[build 1:27:31.6 s] [31/32 complete] [1/6 jobs] [0 queued] [1 failed] [pnc:... 
[build 1:27:31.7 s] [31/32 complete] [1/6 jobs] [0 queued] [1 failed] [pnc:... 
[build 1:27:31.8 s] [31/32 complete] [1/6 jobs] [0 queued] [1 failed] [pnc:... 
[build 1:27:31.9 s] [31/32 complete] [1/6 jobs] [0 queued] [1 failed] [pnc:... 
[build 1:27:32.0 s] [31/32 complete] [1/6 jobs] [0 queued] [1 failed] [pnc:... 
[build 1:27:32.1 s] [31/32 complete] [1/6 jobs] [0 queued] [1 failed] [pnc:... 
[build 1:27:32.2 s] [31/32 complete] [1/6 jobs] [0 queued] [1 failed] [pnc:... 
[build 1:27:32.3 s] [31/32 complete] [1/6 jobs] [0 queued] [1 failed] [pnc:... 
[build 1:27:32.4 s] [31/32 complete] [1/6 jobs] [0 queued] [1 failed] [pnc:... 
[build 1:27:32.5 s] [31/32 complete] [1/6 jobs] [0 queued] [1 failed] [pnc:... 
[build 1:27:32.6 s] [31/32 complete] [1/6 jobs] [0 queued] [1 failed] [pnc:... 
[build 1:27:32.7 s] [31/32 complete] [1/6 jobs] [0 queued] [1 failed] [pnc:... 
[build 1:27:32.8 s] [31/32 complete] [1/6 jobs] [0 queued] [1 failed] [pnc:... 
[build 1:27:32.9 s] [31/32 complete] [1/6 jobs] [0 queued] [1 failed] [pnc:... 
[build 1:27:33.0 s] [31/32 complete] [1/6 jobs] [0 queued] [1 failed] [pnc:... 
[build 1:27:33.1 s] [31/32 complete] [1/6 jobs] [0 queued] [1 failed] [pnc:... 
[build 1:27:33.2 s] [31/32 complete] [1/6 jobs] [0 queued] [1 failed] [pnc:... 
[build 1:27:33.3 s] [31/32 complete] [1/6 jobs] [0 queued] [1 failed] [pnc:... 
[build 1:27:33.4 s] [31/32 complete] [1/6 jobs] [0 queued] [1 failed] [pnc:... 
[build 1:27:33.5 s] [31/32 complete] [1/6 jobs] [0 queued] [1 failed] [pnc:... 
[build 1:27:33.6 s] [31/32 complete] [1/6 jobs] [0 queued] [1 failed] [pnc:... 
[build 1:27:33.7 s] [31/32 complete] [1/6 jobs] [0 queued] [1 failed] [pnc:... 
[build 1:27:33.8 s] [31/32 complete] [1/6 jobs] [0 queued] [1 failed] [pnc:... 
[build 1:27:33.9 s] [31/32 complete] [1/6 jobs] [0 queued] [1 failed] [pnc:... 
[build 1:27:34.0 s] [31/32 complete] [1/6 jobs] [0 queued] [1 failed] [pnc:... 
[build 1:27:34.1 s] [31/32 complete] [1/6 jobs] [0 queued] [1 failed] [pnc:... 
[build 1:27:34.2 s] [31/32 complete] [1/6 jobs] [0 queued] [1 failed] [pnc:... 
[build 1:27:34.3 s] [31/32 complete] [1/6 jobs] [0 queued] [1 failed] [pnc:... 
[build 1:27:34.4 s] [31/32 complete] [1/6 jobs] [0 queued] [1 failed] [pnc:... 
[build 1:27:34.5 s] [31/32 complete] [1/6 jobs] [0 queued] [1 failed] [pnc:... 
[build 1:27:34.6 s] [31/32 complete] [1/6 jobs] [0 queued] [1 failed] [pnc:... 
[build 1:27:34.7 s] [31/32 complete] [1/6 jobs] [0 queued] [1 failed] [pnc:... 
[build 1:27:34.8 s] [31/32 complete] [1/6 jobs] [0 queued] [1 failed] [pnc:... 
[build 1:27:34.9 s] [31/32 complete] [1/6 jobs] [0 queued] [1 failed] [pnc:... 
CMake Warning (dev) at CMakeLists.txt:2 (project):
  Policy CMP0048 is not set: project() command manages VERSION variables.
  Run "cmake --help-policy CMP0048" for policy details.  Use the cmake_policy
  command to set the policy and suppress this warning.

  The following variable(s) would be set to empty:

    CMAKE_PROJECT_VERSION
    CMAKE_PROJECT_VERSION_MAJOR
    CMAKE_PROJECT_VERSION_MINOR
    CMAKE_PROJECT_VERSION_PATCH
This warning is for project developers.  Use -Wno-dev to suppress it.

cd /root/workspace/telediagnostic/build/guardian_msgs; catkin build --get-env guardian_msgs | catkin env -si  /usr/bin/cmake /root/workspace/telediagnostic/src/shared_msgs/guardian_msgs --no-warn-unused-cli -DCATKIN_DEVEL_PREFIX=/root/workspace/telediagnostic/devel/.private/guardian_msgs -DCMAKE_INSTALL_PREFIX=/root/workspace/telediagnostic/install -DUSE_ROS2=OFF -DBUILD_TEST=OFF; cd -

...............................................................................
_______________________________________________________________________________
Warnings << pnc_debug_msg:cmake /root/workspace/telediagnostic/logs/pnc_debug_msg/build.cmake.001.log
CMake Warning (dev) at CMakeLists.txt:2 (project):
  Policy CMP0048 is not set: project() command manages VERSION variables.
  Run "cmake --help-policy CMP0048" for policy details.  Use the cmake_policy
  command to set the policy and suppress this warning.

  The following variable(s) would be set to empty:

    CMAKE_PROJECT_VERSION
    CMAKE_PROJECT_VERSION_MAJOR
    CMAKE_PROJECT_VERSION_MINOR
    CMAKE_PROJECT_VERSION_PATCH
This warning is for project developers.  Use -Wno-dev to suppress it.

cd /root/workspace/telediagnostic/build/pnc_debug_msg; catkin build --get-env pnc_debug_msg | catkin env -si  /usr/bin/cmake /root/workspace/telediagnostic/src/shared_msgs/pnc_debug_msgs --no-warn-unused-cli -DCATKIN_DEVEL_PREFIX=/root/workspace/telediagnostic/devel/.private/pnc_debug_msg -DCMAKE_INSTALL_PREFIX=/root/workspace/telediagnostic/install -DUSE_ROS2=OFF -DBUILD_TEST=OFF; cd -

...............................................................................
_______________________________________________________________________________
Warnings << pnc:cmake /root/workspace/telediagnostic/logs/pnc/build.cmake.000.log
CUDA NOT FOUND
cd /root/workspace/telediagnostic/build/pnc; catkin build --get-env pnc | catkin env -si  /usr/bin/cmake /root/workspace/telediagnostic/src/pnc --no-warn-unused-cli -DCATKIN_DEVEL_PREFIX=/root/workspace/telediagnostic/devel/.private/pnc -DCMAKE_INSTALL_PREFIX=/root/workspace/telediagnostic/install -DUSE_ROS2=OFF -DBUILD_TEST=OFF; cd -

...............................................................................
_______________________________________________________________________________
Warnings << hdmap:cmake /root/workspace/telediagnostic/logs/hdmap/build.cmake.000.log
=============================================================
-- ROS Found, Ros Support is turned On!
=============================================================
=============================================================
-- ROS2 Not Found, Ros2 Support is turned Off!
=============================================================
** WARNING ** io features related to pcap will be disabled
** WARNING ** io features related to png will be disabled
** WARNING ** io features related to libusb-1.0 will be disabled
GIT_COMMIT_HASH:a9c2e4d
cd /root/workspace/telediagnostic/build/hdmap; catkin build --get-env hdmap | catkin env -si  /usr/bin/cmake /root/workspace/telediagnostic/src/hdmap --no-warn-unused-cli -DCATKIN_DEVEL_PREFIX=/root/workspace/telediagnostic/devel/.private/hdmap -DCMAKE_INSTALL_PREFIX=/root/workspace/telediagnostic/install -DUSE_ROS2=OFF -DBUILD_TEST=OFF; cd -

...............................................................................
_______________________________________________________________________________
Warnings << hdmap:make /root/workspace/telediagnostic/logs/hdmap/build.make.000.log
cc1: warning: command line option ‘-std=c++14’ is valid for C++/ObjC++ but not for C
cc1: warning: command line option ‘-std=c++14’ is valid for C++/ObjC++ but not for C
cd /root/workspace/telediagnostic/build/hdmap; catkin build --get-env hdmap | catkin env -si  /usr/bin/make --jobserver-auth=3,4; cd -

...............................................................................
_______________________________________________________________________________
Warnings << snapshot_store:cmake /root/workspace/telediagnostic/logs/snapshot_store/build.cmake.000.log
fatal: not a git repository (or any of the parent directories): .git
fatal: not a git repository (or any of the parent directories): .git
cd /root/workspace/telediagnostic/build/snapshot_store; catkin build --get-env snapshot_store | catkin env -si  /usr/bin/cmake /root/workspace/telediagnostic/src/snapshot_store --no-warn-unused-cli -DCATKIN_DEVEL_PREFIX=/root/workspace/telediagnostic/devel/.private/snapshot_store -DCMAKE_INSTALL_PREFIX=/root/workspace/telediagnostic/install -DUSE_ROS2=OFF -DBUILD_TEST=OFF; cd -

...............................................................................
_______________________________________________________________________________
Errors << snapshot_store:make /root/workspace/telediagnostic/logs/snapshot_store/build.make.000.log
In file included from /root/workspace/telediagnostic/src/pnc/algorithm/decision/lateral_decision.cpp:1:
/root/workspace/telediagnostic/src/pnc/algorithm/decision/lateral_decision.hpp:2:10: fatal error: common/time/time.hpp: No such file or directory
    2 | #include "common/time/time.hpp"
      |          ^~~~~~~~~~~~~~~~~~~~~~
compilation terminated.
make[2]: *** [CMakeFiles/snapshot_store_handler.dir/build.make:76: CMakeFiles/snapshot_store_handler.dir/root/workspace/telediagnostic/src/pnc/algorithm/decision/lateral_decision.cpp.o] Error 1
make[2]: *** Waiting for unfinished jobs....
/root/workspace/telediagnostic/src/snapshot_store/snapshot_store_handler/main.cpp:4:10: fatal error: data/config/cfg_hdmap.hpp: No such file or directory
    4 | #include "data/config/cfg_hdmap.hpp"
      |          ^~~~~~~~~~~~~~~~~~~~~~~~~~~
compilation terminated.
make[2]: *** [CMakeFiles/snapshot_store_handler.dir/build.make:63: CMakeFiles/snapshot_store_handler.dir/snapshot_store_handler/main.cpp.o] Error 1
make[1]: *** [CMakeFiles/Makefile2:3496: CMakeFiles/snapshot_store_handler.dir/all] Error 2
make: *** [Makefile:141: all] Error 2
cd /root/workspace/telediagnostic/build/snapshot_store; catkin build --get-env snapshot_store | catkin env -si  /usr/bin/make --jobserver-auth=3,4; cd -

...............................................................................
Failed << snapshot_store:make                   [ Exited with code 2 ]         
_______________________________________________________________________________
Warnings << pnc:make /root/workspace/telediagnostic/logs/pnc/build.make.000.log
[build 1:27:35.0 s] [31/32 complete] [1/6 jobs] [0 queued] [1 failed] [pnc:... 
[build 1:27:35.1 s] [31/32 complete] [1/6 jobs] [0 queued] [1 failed] [pnc:... 
[build 1:27:35.2 s] [31/32 complete] [1/6 jobs] [0 queued] [1 failed] [pnc:... 
[build 1:27:35.3 s] [31/32 complete] [1/6 jobs] [0 queued] [1 failed] [pnc:... 
[build 1:27:35.4 s] [31/32 complete] [1/6 jobs] [0 queued] [1 failed] [pnc:... 
[build 1:27:35.5 s] [31/32 complete] [1/6 jobs] [0 queued] [1 failed] [pnc:... 
[build 1:27:35.6 s] [31/32 complete] [1/6 jobs] [0 queued] [1 failed] [pnc:... 
[build 1:27:35.7 s] [31/32 complete] [1/6 jobs] [0 queued] [1 failed] [pnc:... 
[build 1:27:35.8 s] [31/32 complete] [1/6 jobs] [0 queued] [1 failed] [pnc:... 
[build 1:27:35.9 s] [31/32 complete] [1/6 jobs] [0 queued] [1 failed] [pnc:... 
[build 1:27:36.0 s] [31/32 complete] [1/6 jobs] [0 queued] [1 failed] [pnc:... 
[build 1:27:36.1 s] [31/32 complete] [1/6 jobs] [0 queued] [1 failed] [pnc:... 
[build 1:27:36.2 s] [31/32 complete] [1/6 jobs] [0 queued] [1 failed] [pnc:... 
[build 1:27:36.3 s] [31/32 complete] [1/6 jobs] [0 queued] [1 failed] [pnc:... 
[build 1:27:36.4 s] [31/32 complete] [1/6 jobs] [0 queued] [1 failed] [pnc:... 
[build 1:27:36.5 s] [31/32 complete] [1/6 jobs] [0 queued] [1 failed] [pnc:... 
[build 1:27:36.6 s] [31/32 complete] [1/6 jobs] [0 queued] [1 failed] [pnc:... 
[build 1:27:36.7 s] [31/32 complete] [1/6 jobs] [0 queued] [1 failed] [pnc:... 
[build 1:27:36.8 s] [31/32 complete] [1/6 jobs] [0 queued] [1 failed] [pnc:... 
[build 1:27:36.9 s] [31/32 complete] [1/6 jobs] [0 queued] [1 failed] [pnc:... 
[build 1:27:37.0 s] [31/32 complete] [1/6 jobs] [0 queued] [1 failed] [pnc:... 
[build 1:27:37.1 s] [31/32 complete] [1/6 jobs] [0 queued] [1 failed] [pnc:... 
[build 1:27:37.2 s] [31/32 complete] [1/6 jobs] [0 queued] [1 failed] [pnc:... 
[build 1:27:37.3 s] [31/32 complete] [1/6 jobs] [0 queued] [1 failed] [pnc:... 
[build 1:27:37.4 s] [31/32 complete] [1/6 jobs] [0 queued] [1 failed] [pnc:... 
[build 1:27:37.5 s] [31/32 complete] [1/6 jobs] [0 queued] [1 failed] [pnc:... 
[build 1:27:37.6 s] [31/32 complete] [1/6 jobs] [0 queued] [1 failed] [pnc:... 
[build 1:27:37.7 s] [31/32 complete] [1/6 jobs] [0 queued] [1 failed] [pnc:... 
[build 1:27:37.8 s] [31/32 complete] [1/6 jobs] [0 queued] [1 failed] [pnc:... 
[build 1:27:37.9 s] [31/32 complete] [1/6 jobs] [0 queued] [1 failed] [pnc:... 
[build 1:27:38.0 s] [31/32 complete] [1/6 jobs] [0 queued] [1 failed] [pnc:... 
[build 1:27:38.1 s] [31/32 complete] [1/6 jobs] [0 queued] [1 failed] [pnc:... 
[build 1:27:38.2 s] [31/32 complete] [1/6 jobs] [0 queued] [1 failed] [pnc:... 
[build 1:27:38.3 s] [31/32 complete] [1/6 jobs] [0 queued] [1 failed] [pnc:... 
[build 1:27:38.4 s] [31/32 complete] [1/6 jobs] [0 queued] [1 failed] [pnc:... 
[build 1:27:38.5 s] [31/32 complete] [1/6 jobs] [0 queued] [1 failed] [pnc:... 
[build 1:27:38.6 s] [31/32 complete] [1/6 jobs] [0 queued] [1 failed] [pnc:... 
[build 1:27:38.7 s] [31/32 complete] [1/6 jobs] [0 queued] [1 failed] [pnc:... 
[build 1:27:38.8 s] [31/32 complete] [1/6 jobs] [0 queued] [1 failed] [pnc:... 
[build 1:27:38.9 s] [31/32 complete] [1/6 jobs] [0 queued] [1 failed] [pnc:... 
[build 1:27:39.0 s] [31/32 complete] [1/6 jobs] [0 queued] [1 failed] [pnc:... 
[build 1:27:39.1 s] [31/32 complete] [1/6 jobs] [0 queued] [1 failed] [pnc:... 
[build 1:27:39.2 s] [31/32 complete] [1/6 jobs] [0 queued] [1 failed] [pnc:... 
[build 1:27:39.3 s] [31/32 complete] [1/6 jobs] [0 queued] [1 failed] [pnc:... 
[build 1:27:39.4 s] [31/32 complete] [1/6 jobs] [0 queued] [1 failed] [pnc:... 
[build 1:27:39.5 s] [31/32 complete] [1/6 jobs] [0 queued] [1 failed] [pnc:... 
[build 1:27:39.6 s] [31/32 complete] [1/6 jobs] [0 queued] [1 failed] [pnc:... 
[build 1:27:39.7 s] [31/32 complete] [1/6 jobs] [0 queued] [1 failed] [pnc:... 
[build 1:27:39.8 s] [31/32 complete] [1/6 jobs] [0 queued] [1 failed] [pnc:... 
[build 1:27:39.9 s] [31/32 complete] [1/6 jobs] [0 queued] [1 failed] [pnc:... 
[build 1:27:40.0 s] [31/32 complete] [1/6 jobs] [0 queued] [1 failed] [pnc:... 
[build 1:27:40.1 s] [31/32 complete] [1/6 jobs] [0 queued] [1 failed] [pnc:... 
[build 1:27:40.2 s] [31/32 complete] [1/6 jobs] [0 queued] [1 failed] [pnc:... 
[build 1:27:40.3 s] [31/32 complete] [1/6 jobs] [0 queued] [1 failed] [pnc:... 
[build 1:27:40.4 s] [31/32 complete] [1/6 jobs] [0 queued] [1 failed] [pnc:... 
[build 1:27:40.5 s] [31/32 complete] [1/6 jobs] [0 queued] [1 failed] [pnc:... 
/root/workspace/telediagnostic/src/pnc/algorithm/wbca/imv_wbca_manager.cpp: In member function ‘virtual bool senior::pnc::algorithm::IMVWBCAManager::UpdateRoute2()’:
/root/workspace/telediagnostic/src/pnc/algorithm/wbca/imv_wbca_manager.cpp:428:50: warning: ‘*((void*)& pre_vt_point +8)’ may be used uninitialized in this function [-Wmaybe-uninitialized]
  428 |            static_cast<decimal_t>(cur_vt_pint[1] - pre_vt_point[1])});
/root/workspace/telediagnostic/src/pnc/algorithm/wbca/imv_wbca_manager.cpp:427:39: warning: ‘pre_vt_point’ may be used uninitialized in this function [-Wmaybe-uninitialized]
  427 |           {static_cast<decimal_t>(fmax(cur_vt_pint[0], pre_vt_point[0])),
      |                                   ~~~~^~~~~~~~~~~~~~~~~~~~~~~~~~~~~~~~~
/root/workspace/telediagnostic/src/pnc/algorithm/wbca/path_optimization/truck_path_optimization.cpp: In member function ‘bool senior::pnc::algorithm::TruckPathOptimization::TransToPath()’:
/root/workspace/telediagnostic/src/pnc/algorithm/wbca/path_optimization/truck_path_optimization.cpp:261:35: warning: ‘*((void*)& trailer_heading_data +16)’ may be used uninitialized in this function [-Wmaybe-uninitialized]
  261 |           trailer_heading_data[0] - trailer_heading_data[2];
/root/workspace/telediagnostic/src/pnc/algorithm/wbca/path_optimization/truck_path_optimization.cpp:261:35: warning: ‘trailer_heading_data’ may be used uninitialized in this function [-Wmaybe-uninitialized]
/root/workspace/telediagnostic/src/pnc/algorithm/wbca/imv_wbca_manager.cpp: In member function ‘virtual bool senior::pnc::algorithm::IMVWBCAManager::UpdateRoute2()’:
/root/workspace/telediagnostic/src/pnc/algorithm/wbca/imv_wbca_manager.cpp:428:50: warning: ‘*((void*)& pre_vt_point +8)’ may be used uninitialized in this function [-Wmaybe-uninitialized]
  428 |            static_cast<decimal_t>(cur_vt_pint[1] - pre_vt_point[1])});
/root/workspace/telediagnostic/src/pnc/algorithm/wbca/imv_wbca_manager.cpp:427:39: warning: ‘pre_vt_point’ may be used uninitialized in this function [-Wmaybe-uninitialized]
  427 |           {static_cast<decimal_t>(fmax(cur_vt_pint[0], pre_vt_point[0])),
      |                                   ~~~~^~~~~~~~~~~~~~~~~~~~~~~~~~~~~~~~~
/root/workspace/telediagnostic/src/pnc/common/zip/mini_zip.cpp: In static member function ‘static bool senior::common::MiniZip::ZipFiles(std::string, std::vector<std::__cxx11::basic_string<char> >, const senior::common::ZipParams&)’:
/root/workspace/telediagnostic/src/pnc/common/zip/mini_zip.cpp:311:9: warning: ‘fin’ may be used uninitialized in this function [-Wmaybe-uninitialized]
  311 |         if (fin) fclose(fin);
      |         ^~
/root/workspace/telediagnostic/src/pnc/algorithm/wbca/path_optimization/truck_path_optimization.cpp: In member function ‘bool senior::pnc::algorithm::TruckPathOptimization::TransToPath()’:
/root/workspace/telediagnostic/src/pnc/algorithm/wbca/path_optimization/truck_path_optimization.cpp:261:35: warning: ‘*((void*)& trailer_heading_data +16)’ may be used uninitialized in this function [-Wmaybe-uninitialized]
  261 |           trailer_heading_data[0] - trailer_heading_data[2];
/root/workspace/telediagnostic/src/pnc/algorithm/wbca/path_optimization/truck_path_optimization.cpp:261:35: warning: ‘trailer_heading_data’ may be used uninitialized in this function [-Wmaybe-uninitialized]
/root/workspace/telediagnostic/src/pnc/common/zip/mini_zip.cpp: In static member function ‘static bool senior::common::MiniZip::ZipFiles(std::string, std::vector<std::__cxx11::basic_string<char> >, const senior::common::ZipParams&)’:
/root/workspace/telediagnostic/src/pnc/common/zip/mini_zip.cpp:311:9: warning: ‘fin’ may be used uninitialized in this function [-Wmaybe-uninitialized]
  311 |         if (fin) fclose(fin);
      |         ^~
/root/workspace/telediagnostic/src/pnc/data/boundary/road_boundary.cpp: In member function ‘void senior::pnc::data::RoadBoundary::GenerateSwitchShiftL(senior::pnc::data::PlanFrame&, const senior::pnc::data::GuideLine&)’:
/root/workspace/telediagnostic/src/pnc/data/boundary/road_boundary.cpp:903:34: warning: ‘right_shift_l’ may be used uninitialized in this function [-Wmaybe-uninitialized]
  903 |     boundary_pt.set_right_shift_l(right_shift_l);
      |     ~~~~~~~~~~~~~~~~~~~~~~~~~~~~~^~~~~~~~~~~~~~~
/root/workspace/telediagnostic/src/pnc/data/boundary/road_boundary.cpp:902:33: warning: ‘left_shift_l’ may be used uninitialized in this function [-Wmaybe-uninitialized]
  902 |     boundary_pt.set_left_shift_l(left_shift_l);
      |     ~~~~~~~~~~~~~~~~~~~~~~~~~~~~^~~~~~~~~~~~~~
/root/workspace/telediagnostic/src/pnc/data/boundary/road_boundary.cpp: In member function ‘void senior::pnc::data::RoadBoundary::GenerateSwitchShiftL(senior::pnc::data::PlanFrame&, const senior::pnc::data::GuideLine&)’:
/root/workspace/telediagnostic/src/pnc/data/boundary/road_boundary.cpp:903:34: warning: ‘right_shift_l’ may be used uninitialized in this function [-Wmaybe-uninitialized]
  903 |     boundary_pt.set_right_shift_l(right_shift_l);
      |     ~~~~~~~~~~~~~~~~~~~~~~~~~~~~~^~~~~~~~~~~~~~~
/root/workspace/telediagnostic/src/pnc/data/boundary/road_boundary.cpp:902:33: warning: ‘left_shift_l’ may be used uninitialized in this function [-Wmaybe-uninitialized]
  902 |     boundary_pt.set_left_shift_l(left_shift_l);
      |     ~~~~~~~~~~~~~~~~~~~~~~~~~~~~^~~~~~~~~~~~~~
/root/workspace/telediagnostic/src/pnc/io/string_compress.cpp: In static member function ‘static int senior::StringCompress::DecompressString(const string&, std::string&)’:
/root/workspace/telediagnostic/src/pnc/io/string_compress.cpp:115:15: warning: this statement may fall through [-Wimplicit-fallthrough=]
  115 |           ret = Z_DATA_ERROR; /* and fall through */
      |               ^
/root/workspace/telediagnostic/src/pnc/io/string_compress.cpp:116:9: note: here
  116 |         case Z_DATA_ERROR:
      |         ^~~~
/root/workspace/telediagnostic/src/pnc/io/string_compress.cpp: In static member function ‘static int senior::StringCompress::DecompressString(const string&, std::string&)’:
/root/workspace/telediagnostic/src/pnc/io/string_compress.cpp:115:15: warning: this statement may fall through [-Wimplicit-fallthrough=]
  115 |           ret = Z_DATA_ERROR; /* and fall through */
      |               ^
/root/workspace/telediagnostic/src/pnc/io/string_compress.cpp:116:9: note: here
  116 |         case Z_DATA_ERROR:
      |         ^~~~
cd /root/workspace/telediagnostic/build/pnc; catkin build --get-env pnc | catkin env -si  /usr/bin/make --jobserver-auth=3,4; cd -

...............................................................................
Finished <<< pnc                                  [ 1 hour 25 minutes and 24.0 seconds ]
[build] Summary: 31 of 32 packages succeeded.                                  
[build] Ignored: None.                                                         
[build] Warnings: 19 packages succeeded with warnings.                         
[build] Abandoned: No packages were abandoned.                                 
[build] Failed: 1 packages failed.                                             
[build] Runtime: 1 hour 27 minutes and 40.6 seconds total.                     
[build] Note: Workspace packages have changed, please re-source setup files to use them.
[Pipeline] }
[Pipeline] // dir
[Pipeline] }
[Pipeline] // script
[Pipeline] }
[Pipeline] // stage
[Pipeline] stage
[Pipeline] { (zip->post)
Stage "zip->post" skipped due to earlier failure(s)
[Pipeline] }
[Pipeline] // stage
[Pipeline] stage
[Pipeline] { (Declarative: Post Actions)
[Pipeline] script
[Pipeline] {
[Pipeline] echo
always
[Pipeline] }
[Pipeline] // script
[Pipeline] script
[Pipeline] {
[Pipeline] echo
failure
[Pipeline] wrap
[Pipeline] {
[Pipeline] script
[Pipeline] {
[Pipeline] echo
user: , telphone: 
[Pipeline] }
[Pipeline] // script
[Pipeline] script
[Pipeline] {
[Pipeline] echo
user: , telphone: 
[Pipeline] }
[Pipeline] // script
[Pipeline] sh
+ curl -X POST 'https://oapi.dingtalk.com/robot/send?access_token=0e635ba9c724e48482d5e4146087ccb44e6b324d34f5e351b80db04fcf41017a' -H 'Content-Type: application/json' -d '{"msgtype": "markdown","markdown": {"title":"Jenkins通知","text": "# 版本编译失败    
    
### [telediagnostic更新(前港远望)] 
 ---  
  - 任务名: [telediagnostic] 
  - 任务号: # 129  
  - 状态:<font color=#FF5151> 编译失败 </font> 
  - 执行人:wuyanjun 
  ---  
   > 请检查失败原因 @"},"at": {"atMobiles": [""],"isAtAll": "false"} }'
  % Total    % Received % Xferd  Average Speed   Time    Time     Time  Current
                                 Dload  Upload   Total   Spent    Left  Speed

  0     0    0     0    0     0      0      0 --:--:-- --:--:-- --:--:--     0
100   402  100    27  100   375    385   5357 --:--:-- --:--:-- --:--:--  5742
[Pipeline] echo
{"errcode":0,"errmsg":"ok"}
[Pipeline] }
[Pipeline] // wrap
[Pipeline] }
[Pipeline] // script
[Pipeline] }
[Pipeline] // stage
[Pipeline] }
[Pipeline] // withEnv
[Pipeline] }
[Pipeline] // withEnv
[Pipeline] }
[Pipeline] // node
[Pipeline] End of Pipeline
ERROR: script returned exit code 1
Finished: FAILURE