Console Output

Skipping 3,450 KB.. Full Log
...............................................................................
_______________________________________________________________________________
Warnings << hd_control_pkg:make /senior/workspace/orin-slave32/slave/logs/hd_control_pkg/build.make.000.log
In file included from /senior/workspace/orin-slave32/slave/src/hdcontrol/src/Server/RosServer.h:5,
                 from /senior/workspace/orin-slave32/slave/src/hdcontrol/src/Server/RosServer.cpp:1:
/senior/workspace/orin-slave32/slave/src/hdcontrol/src/Utils/I2cServer.h: In member function ‘u_char senior::I2cServer::get_result(const u_char&, const u_char&)’:
/senior/workspace/orin-slave32/slave/src/hdcontrol/src/Utils/I2cServer.h:50:10: warning: ignoring return value of ‘ssize_t write(int, const void*, size_t)’, declared with attribute warn_unused_result [-Wunused-result]
   50 |     write(fd, &data_address, 1);
      |     ~~~~~^~~~~~~~~~~~~~~~~~~~~~
/senior/workspace/orin-slave32/slave/src/hdcontrol/src/Utils/Utils.cpp: In function ‘int convertBit2CameraId(bool, int)’:
/senior/workspace/orin-slave32/slave/src/hdcontrol/src/Utils/Utils.cpp:60:1: warning: control reaches end of non-void function [-Wreturn-type]
   60 | }
      | ^
cd /senior/workspace/orin-slave32/slave/build/hd_control_pkg; catkin build --get-env hd_control_pkg | catkin env -si  /usr/bin/make --jobserver-auth=3,4; cd -

...............................................................................
_______________________________________________________________________________
Warnings << RMInterpreter:make /senior/workspace/orin-slave32/slave/logs/RMInterpreter/build.make.000.log
In file included from /senior/workspace/orin-slave32/slave/src/rminterpreter/src/RMInterpreter/rm_message_convert.h:18,
                 from /senior/workspace/orin-slave32/slave/src/rminterpreter/src/RMInterpreter/powercmd_processer.h:23,
                 from /senior/workspace/orin-slave32/slave/src/rminterpreter/src/RMInterpreter/ros_mqtt_bridge.h:21,
                 from /senior/workspace/orin-slave32/slave/src/rminterpreter/src/RMInterpreter/main.cpp:8:
/senior/workspace/orin-slave32/slave/src/rminterpreter/src/RMInterpreter/rm_message_convert.h: In member function ‘std::string senior::ROS2MQTTMessageConverter::do_ros_msf_localization_msgs_Localization(const Localization&)’:
/senior/workspace/orin-slave32/slave/src/rminterpreter/src/RMInterpreter/json_common.h:47:39: warning: unused variable ‘allocator’ [-Wunused-variable]
   47 |   rapidjson::Document::AllocatorType &allocator = document.GetAllocator();
      |                                       ^~~~~~~~~
/senior/workspace/orin-slave32/slave/src/rminterpreter/src/RMInterpreter/json_common.h:47:39: note: in definition of macro ‘JSON_BEGIN’
   47 |   rapidjson::Document::AllocatorType &allocator = document.GetAllocator();
      |                                       ^~~~~~~~~
/senior/workspace/orin-slave32/slave/src/rminterpreter/src/RMInterpreter/rm_message_convert.h: In member function ‘std::string senior::ROS2MQTTMessageConverter::do_ros_msf_localization_msgs_LocalizationStatus(const LocalizationStatus&)’:
/senior/workspace/orin-slave32/slave/src/rminterpreter/src/RMInterpreter/json_common.h:47:39: warning: unused variable ‘allocator’ [-Wunused-variable]
   47 |   rapidjson::Document::AllocatorType &allocator = document.GetAllocator();
      |                                       ^~~~~~~~~
/senior/workspace/orin-slave32/slave/src/rminterpreter/src/RMInterpreter/json_common.h:47:39: note: in definition of macro ‘JSON_BEGIN’
   47 |   rapidjson::Document::AllocatorType &allocator = document.GetAllocator();
      |                                       ^~~~~~~~~
In file included from /senior/workspace/orin-slave32/slave/src/rminterpreter/src/RMInterpreter/rm_message_convert.h:18,
                 from /senior/workspace/orin-slave32/slave/src/rminterpreter/src/RMInterpreter/powercmd_processer.h:23,
                 from /senior/workspace/orin-slave32/slave/src/rminterpreter/src/RMInterpreter/powercmd_processer.cpp:1:
/senior/workspace/orin-slave32/slave/src/rminterpreter/src/RMInterpreter/rm_message_convert.h: In member function ‘std::string senior::ROS2MQTTMessageConverter::do_ros_msf_localization_msgs_Localization(const Localization&)’:
/senior/workspace/orin-slave32/slave/src/rminterpreter/src/RMInterpreter/json_common.h:47:39: warning: unused variable ‘allocator’ [-Wunused-variable]
   47 |   rapidjson::Document::AllocatorType &allocator = document.GetAllocator();
      |                                       ^~~~~~~~~
/senior/workspace/orin-slave32/slave/src/rminterpreter/src/RMInterpreter/json_common.h:47:39: note: in definition of macro ‘JSON_BEGIN’
   47 |   rapidjson::Document::AllocatorType &allocator = document.GetAllocator();
      |                                       ^~~~~~~~~
/senior/workspace/orin-slave32/slave/src/rminterpreter/src/RMInterpreter/rm_message_convert.h: In member function ‘std::string senior::ROS2MQTTMessageConverter::do_ros_msf_localization_msgs_LocalizationStatus(const LocalizationStatus&)’:
/senior/workspace/orin-slave32/slave/src/rminterpreter/src/RMInterpreter/json_common.h:47:39: warning: unused variable ‘allocator’ [-Wunused-variable]
   47 |   rapidjson::Document::AllocatorType &allocator = document.GetAllocator();
      |                                       ^~~~~~~~~
/senior/workspace/orin-slave32/slave/src/rminterpreter/src/RMInterpreter/json_common.h:47:39: note: in definition of macro ‘JSON_BEGIN’
   47 |   rapidjson::Document::AllocatorType &allocator = document.GetAllocator();
      |                                       ^~~~~~~~~
In file included from /senior/workspace/orin-slave32/slave/src/rminterpreter/src/RMInterpreter/rm_message_convert.h:18,
                 from /senior/workspace/orin-slave32/slave/src/rminterpreter/src/RMInterpreter/powercmd_processer.h:23,
                 from /senior/workspace/orin-slave32/slave/src/rminterpreter/src/RMInterpreter/ros_mqtt_bridge.h:21,
                 from /senior/workspace/orin-slave32/slave/src/rminterpreter/src/RMInterpreter/ros_mqtt_bridge.cpp:1:
/senior/workspace/orin-slave32/slave/src/rminterpreter/src/RMInterpreter/rm_message_convert.h: In member function ‘std::string senior::ROS2MQTTMessageConverter::do_ros_msf_localization_msgs_Localization(const Localization&)’:
/senior/workspace/orin-slave32/slave/src/rminterpreter/src/RMInterpreter/json_common.h:47:39: warning: unused variable ‘allocator’ [-Wunused-variable]
   47 |   rapidjson::Document::AllocatorType &allocator = document.GetAllocator();
      |                                       ^~~~~~~~~
/senior/workspace/orin-slave32/slave/src/rminterpreter/src/RMInterpreter/json_common.h:47:39: note: in definition of macro ‘JSON_BEGIN’
   47 |   rapidjson::Document::AllocatorType &allocator = document.GetAllocator();
      |                                       ^~~~~~~~~
/senior/workspace/orin-slave32/slave/src/rminterpreter/src/RMInterpreter/rm_message_convert.h: In member function ‘std::string senior::ROS2MQTTMessageConverter::do_ros_msf_localization_msgs_LocalizationStatus(const LocalizationStatus&)’:
/senior/workspace/orin-slave32/slave/src/rminterpreter/src/RMInterpreter/json_common.h:47:39: warning: unused variable ‘allocator’ [-Wunused-variable]
   47 |   rapidjson::Document::AllocatorType &allocator = document.GetAllocator();
      |                                       ^~~~~~~~~
/senior/workspace/orin-slave32/slave/src/rminterpreter/src/RMInterpreter/json_common.h:47:39: note: in definition of macro ‘JSON_BEGIN’
   47 |   rapidjson::Document::AllocatorType &allocator = document.GetAllocator();
      |                                       ^~~~~~~~~
cd /senior/workspace/orin-slave32/slave/build/RMInterpreter; catkin build --get-env RMInterpreter | catkin env -si  /usr/bin/make --jobserver-auth=3,4; cd -

...............................................................................
_______________________________________________________________________________
Errors << lidar_loc_v2:make /senior/workspace/orin-slave32/slave/logs/lidar_loc_v2/build.make.000.log
In file included from /senior/workspace/orin-slave32/slave/src/lidar_loc_v2/update/evaluate/map_evaluate.cpp:5:
/senior/workspace/orin-slave32/slave/src/lidar_loc_v2/update/evaluate/map_evaluate.h: In instantiation of ‘update::MapEvaluate<PointType>::MapEvaluate(const typename pcl::PointCloud<PointT>::Ptr&) [with PointType = pcl::PointXYZI; typename pcl::PointCloud<PointT>::Ptr = boost::shared_ptr<pcl::PointCloud<pcl::PointXYZI> >]’:
/senior/workspace/orin-slave32/slave/src/lidar_loc_v2/update/evaluate/map_evaluate.cpp:412:24:   required from here
/senior/workspace/orin-slave32/slave/src/lidar_loc_v2/update/evaluate/map_evaluate.h:65:44: warning: ‘update::MapEvaluate<pcl::PointXYZI>::map_pcl_ptr_’ will be initialized after [-Wreorder]
   65 |   typename pcl::PointCloud<PointType>::Ptr map_pcl_ptr_ = nullptr;
      |                                            ^~~~~~~~~~~~
/senior/workspace/orin-slave32/slave/src/lidar_loc_v2/update/evaluate/map_evaluate.h:49:40: warning:   ‘pcl::PointCloud<pcl::PointXYZI>::Ptr update::MapEvaluate<pcl::PointXYZI>::pcl_with_color’ [-Wreorder]
   49 |   pcl::PointCloud<pcl::PointXYZI>::Ptr pcl_with_color = nullptr;
      |                                        ^~~~~~~~~~~~~~
/senior/workspace/orin-slave32/slave/src/lidar_loc_v2/update/evaluate/map_evaluate.h:41:3: warning:   when initialized here [-Wreorder]
   41 |   MapEvaluate(const typename pcl::PointCloud<PointType>::Ptr& map_pcl_ptr)
      |   ^~~~~~~~~~~
/senior/workspace/orin-slave32/slave/src/lidar_loc_v2/update/evaluate/map_evaluate.cpp: In instantiation of ‘void update::MapEvaluate<PointType>::ComEigenValue(update::OCTO_TREE_NODE<PointType>&) [with PointType = pcl::PointXYZI]’:
/senior/workspace/orin-slave32/slave/src/lidar_loc_v2/update/evaluate/map_evaluate.cpp:412:24:   required from here
/senior/workspace/orin-slave32/slave/src/lidar_loc_v2/update/evaluate/map_evaluate.cpp:363:23: warning: variable ‘Uev’ set but not used [-Wunused-but-set-variable]
  363 |       Eigen::Matrix3f Uev = saes.eigenvectors();
      |                       ^~~
/senior/workspace/orin-slave32/slave/src/lidar_loc_v2/update/evaluate/map_evaluate.cpp: In member function ‘void update::MapEvaluate<PointType>::DividePoints() [with PointType = pcl::PointXYZI]’:
/senior/workspace/orin-slave32/slave/src/lidar_loc_v2/update/evaluate/map_evaluate.cpp:309:9: warning: ‘child_index’ may be used uninitialized in this function [-Wmaybe-uninitialized]
  309 |     int child_index;
      |         ^~~~~~~~~~~
/senior/workspace/orin-slave32/slave/src/lidar_loc_v2/common/util/overlay_text_integrator.cpp: In member function ‘std::string common::OverlayTextIntegrator::MeasStatusToString(int)’:
/senior/workspace/orin-slave32/slave/src/lidar_loc_v2/common/util/overlay_text_integrator.cpp:134:19: warning: suggest parentheses around comparison in operand of ‘&’ [-Wparentheses]
  134 |   if (state & 0x1 == 0x1) {
      |               ~~~~^~~~~~
/senior/workspace/orin-slave32/slave/src/lidar_loc_v2/common/util/overlay_text_integrator.cpp:139:25: warning: suggest parentheses around comparison in operand of ‘&’ [-Wparentheses]
  139 |   if (state >> 1U & 0x1 == 0x1) {
      |                     ~~~~^~~~~~
/senior/workspace/orin-slave32/slave/src/lidar_loc_v2/common/util/overlay_text_integrator.cpp:144:25: warning: suggest parentheses around comparison in operand of ‘&’ [-Wparentheses]
  144 |   if (state >> 2U & 0x1 == 0x1) {
      |                     ~~~~^~~~~~
/senior/workspace/orin-slave32/slave/src/lidar_loc_v2/common/util/overlay_text_integrator.cpp:149:25: warning: suggest parentheses around comparison in operand of ‘&’ [-Wparentheses]
  149 |   if (state >> 3U & 0x1 == 0x1) {
      |                     ~~~~^~~~~~
/senior/workspace/orin-slave32/slave/src/lidar_loc_v2/common/util/overlay_text_integrator.cpp:154:25: warning: suggest parentheses around comparison in operand of ‘&’ [-Wparentheses]
  154 |   if (state >> 4U & 0x1 == 0x1) {
      |                     ~~~~^~~~~~
/senior/workspace/orin-slave32/slave/src/lidar_loc_v2/common/util/overlay_text_integrator.cpp:159:25: warning: suggest parentheses around comparison in operand of ‘&’ [-Wparentheses]
  159 |   if (state >> 5U & 0x1 == 0x1) {
      |                     ~~~~^~~~~~
/senior/workspace/orin-slave32/slave/src/lidar_loc_v2/common/util/overlay_text_integrator.cpp:164:25: warning: suggest parentheses around comparison in operand of ‘&’ [-Wparentheses]
  164 |   if (state >> 6U & 0x1 == 0x1) {
      |                     ~~~~^~~~~~
/senior/workspace/orin-slave32/slave/src/lidar_loc_v2/loc/lidar/reflect_match/feature/feature_extractor.cpp: In member function ‘void loc::feature::FeatureExtractor::AccumulateFeature(const loc::feature::Feature&, const common::TimePose&, const PclPcdPtr&, loc::PclPcdPtr&)’:
/senior/workspace/orin-slave32/slave/src/lidar_loc_v2/loc/lidar/reflect_match/feature/feature_extractor.cpp:293:8: warning: variable ‘stay_still’ set but not used [-Wunused-but-set-variable]
  293 |   bool stay_still = false;
      |        ^~~~~~~~~~
/senior/workspace/orin-slave32/slave/src/lidar_loc_v2/loc/lidar/src/data_interface.cpp: In function ‘std::string loc::MeasStatusToString(int)’:
/senior/workspace/orin-slave32/slave/src/lidar_loc_v2/loc/lidar/src/data_interface.cpp:187:19: warning: suggest parentheses around comparison in operand of ‘&’ [-Wparentheses]
  187 |   if (state & 0x1 == 0x1) {
      |               ~~~~^~~~~~
/senior/workspace/orin-slave32/slave/src/lidar_loc_v2/loc/lidar/src/data_interface.cpp:192:25: warning: suggest parentheses around comparison in operand of ‘&’ [-Wparentheses]
  192 |   if (state >> 1U & 0x1 == 0x1) {
      |                     ~~~~^~~~~~
/senior/workspace/orin-slave32/slave/src/lidar_loc_v2/loc/lidar/src/data_interface.cpp:197:25: warning: suggest parentheses around comparison in operand of ‘&’ [-Wparentheses]
  197 |   if (state >> 2U & 0x1 == 0x1) {
      |                     ~~~~^~~~~~
/senior/workspace/orin-slave32/slave/src/lidar_loc_v2/loc/lidar/src/data_interface.cpp:202:25: warning: suggest parentheses around comparison in operand of ‘&’ [-Wparentheses]
  202 |   if (state >> 3U & 0x1 == 0x1) {
      |                     ~~~~^~~~~~
/senior/workspace/orin-slave32/slave/src/lidar_loc_v2/loc/lidar/src/data_interface.cpp:207:25: warning: suggest parentheses around comparison in operand of ‘&’ [-Wparentheses]
  207 |   if (state >> 4U & 0x1 == 0x1) {
      |                     ~~~~^~~~~~
/senior/workspace/orin-slave32/slave/src/lidar_loc_v2/loc/lidar/src/data_interface.cpp:212:25: warning: suggest parentheses around comparison in operand of ‘&’ [-Wparentheses]
  212 |   if (state >> 5U & 0x1 == 0x1) {
      |                     ~~~~^~~~~~
/senior/workspace/orin-slave32/slave/src/lidar_loc_v2/loc/lidar/src/data_interface.cpp:217:25: warning: suggest parentheses around comparison in operand of ‘&’ [-Wparentheses]
  217 |   if (state >> 6U & 0x1 == 0x1) {
      |                     ~~~~^~~~~~
/senior/workspace/orin-slave32/slave/src/lidar_loc_v2/loc/app/lidar_loc_v2_node_impl.cpp: In member function ‘bool loc::LidarLocV2NodeImpl::ReceiveResetSignal(const int&)’:
/senior/workspace/orin-slave32/slave/src/lidar_loc_v2/loc/app/lidar_loc_v2_node_impl.cpp:821:35: warning: suggest parentheses around comparison in operand of ‘&’ [-Wparentheses]
  821 |   if (ins_meas_status >> 6U & 0x1 == 0x1) {
      |                               ~~~~^~~~~~
/usr/bin/ld: /senior/workspace/orin-slave32/slave/devel/.private/lidar_loc_v2/lib/liblidar_localization.so: undefined reference to `msf_updates::position_measurement::PositionMeasurement::reject_recovery_window_'
collect2: error: ld returned 1 exit status
make[2]: *** [loc/app/CMakeFiles/check_sr_bag.dir/build.make:627: /senior/workspace/orin-slave32/slave/devel/.private/lidar_loc_v2/lib/lidar_loc_v2/check_sr_bag] Error 1
make[1]: *** [CMakeFiles/Makefile2:5354: loc/app/CMakeFiles/check_sr_bag.dir/all] Error 2
make[1]: *** Waiting for unfinished jobs....
/usr/bin/ld: /senior/workspace/orin-slave32/slave/devel/.private/lidar_loc_v2/lib/liblidar_localization.so: undefined reference to `msf_updates::position_measurement::PositionMeasurement::reject_recovery_window_'
collect2: error: ld returned 1 exit status
make[2]: *** [loc/app/CMakeFiles/lidar_loc_v2_node.dir/build.make:628: /senior/workspace/orin-slave32/slave/devel/.private/lidar_loc_v2/lib/lidar_loc_v2/lidar_loc_v2_node] Error 1
make[1]: *** [CMakeFiles/Makefile2:5388: loc/app/CMakeFiles/lidar_loc_v2_node.dir/all] Error 2
make: *** [Makefile:141: all] Error 2
cd /senior/workspace/orin-slave32/slave/build/lidar_loc_v2; catkin build --get-env lidar_loc_v2 | catkin env -si  /usr/bin/make --jobserver-auth=3,4; cd -

...............................................................................
Failed << lidar_loc_v2:make                      [ Exited with code 2 ]        
Failed <<< lidar_loc_v2                          [ 7 minutes and 53.8 seconds ]
[build] Summary: 61 of 62 packages succeeded.                                  
[build] Ignored: None.                                                         
[build] Warnings: 41 packages succeeded with warnings.                         
[build] Abandoned: No packages were abandoned.                                 
[build] Failed: 1 packages failed.                                             
[build] Runtime: 14 minutes and 1.0 seconds total.                             
[build] Note: Workspace packages have changed, please re-source setup files to use them.
[Pipeline] }
[Pipeline] // dir
[Pipeline] }
[Pipeline] // script
[Pipeline] }
[Pipeline] // stage
[Pipeline] stage
[Pipeline] { (zip->post)
Stage "zip->post" skipped due to earlier failure(s)
[Pipeline] }
[Pipeline] // stage
[Pipeline] stage
[Pipeline] { (Declarative: Post Actions)
[Pipeline] script
[Pipeline] {
[Pipeline] echo
always
[Pipeline] sh
+ rm -rf /senior/workspace/orin-slave32/slave/.catkin_tools /senior/workspace/orin-slave32/slave/build/ /senior/workspace/orin-slave32/slave/devel/ /senior/workspace/orin-slave32/slave/install /senior/workspace/orin-slave32/slave/logs/
[Pipeline] }
[Pipeline] // script
[Pipeline] script
[Pipeline] {
[Pipeline] echo
failure: build
[Pipeline] sh
+ rm -rf /senior/workspace/commit/orin-slave32/slave_tmp
[Pipeline] wrap
[Pipeline] {
[Pipeline] script
[Pipeline] {
[Pipeline] echo
user: , telphone: null
[Pipeline] echo
用户不存在列表中
[Pipeline] }
[Pipeline] // script
[Pipeline] sh
+ curl -X POST 'http://143.64.81.104:8080/robot/send?access_token=0e635ba9c724e48482d5e4146087ccb44e6b324d34f5e351b80db04fcf41017a' -H 'Content-Type: application/json' -d '{"msgtype": "markdown","markdown": {"title":"Jenkins通知","text": "# 版本编译失败    
    
### [苏溪集卡从orin全量] 
 ---  
  - 任务名: [orin-slave32] 
  - 任务号: # 488  
  - 阶段:build  
  - 已上传平台:   
  - 状态:<font color=#FF5151> 编译失败 </font> 
  - 执行人:weilikang 
   ---  
   > 请检查失败原因  "},"at": {"atMobiles": [""],"isAtAll": "false"} }'
  % Total    % Received % Xferd  Average Speed   Time    Time     Time  Current
                                 Dload  Upload   Total   Spent    Left  Speed

  0     0    0     0    0     0      0      0 --:--:-- --:--:-- --:--:--     0
100   438  100    27  100   411    236   3605 --:--:-- --:--:-- --:--:--  3842
[Pipeline] echo
{"errcode":0,"errmsg":"ok"}
[Pipeline] }
[Pipeline] // wrap
[Pipeline] }
[Pipeline] // script
[Pipeline] }
[Pipeline] // stage
[Pipeline] }
[Pipeline] // timeout
[Pipeline] }
Lock released on resource [Label: orin-arm, Quantity: 1]
[Pipeline] // lock
[Pipeline] }
[Pipeline] // withEnv
[Pipeline] }
[Pipeline] // withEnv
[Pipeline] }
[Pipeline] // node
[Pipeline] End of Pipeline
ERROR: script returned exit code 1
Finished: FAILURE